{"text_format":"1","workbook":"xlsx","n_sheets":3,"sheets":["Teil 1","Teil 1+2","Notenmatrix"],"not_rendered":{"charts":0,"images":3,"macros":1,"external_links":0,"defined_names":2,"comments":2,"pivot_tables":0},"unopened":[],"bounds":{"document_bytes":16777216,"sheet_cells":100000,"rows_first":2000,"rows_last":500,"rows_between":2000,"halvings":0,"cell_chars":16384,"cell_head_chars":4096},"cells_cut":0,"cells_raw":0,"read":"whole","date_system":"1900"}

{"sheet":"Teil 1","index":0,"n_rows":30,"n_cols":12,"rows_kept":30,"cut":false,"hidden":false,"merged":[[12,1,12,2],[14,1,14,2],[14,3,14,4],[13,3,13,4],[12,3,12,4],[1,4,7,10],[11,1,11,3],[8,1,8,4],[9,1,9,4],[10,1,10,4],[13,1,13,2],[16,1,16,3],[17,8,17,9],[19,1,20,3],[19,4,20,4],[19,5,20,5],[19,6,20,6],[19,7,20,7],[17,5,18,5],[17,6,18,6],[17,7,18,7],[18,8,18,9],[19,8,30,9],[19,10,30,10],[21,1,22,3],[21,4,22,4],[21,5,22,5],[21,6,22,6],[21,7,22,7],[23,1,24,3],[23,4,24,4],[23,5,24,5],[23,7,24,7],[25,1,26,3],[25,4,26,4],[25,5,26,5],[25,6,26,6],[25,7,26,7],[16,8,16,11],[17,10,17,11],[17,4,18,4],[17,1,18,3],[19,11,30,11],[27,1,28,3],[27,4,28,4],[27,5,28,5],[27,6,28,6],[27,7,28,7],[29,1,30,3],[29,4,30,4],[29,5,30,5],[29,6,30,6],[29,7,30,7],[23,6,24,6]]}
[]
[null,"Version: 2023 ZVEH"]
[null,"Gültig für Ausbildungsverordnung ab 2021"]
[]
[]
[]
[]
[]
[null,"Ergebnisberechnung  für den Teil 1 der "]
[null,"Gesellenprüfung zum/zur Elektroniker/-in"]
[null,"Fachrichtung Energie- und Gebäudetechnik"]
[]
[null,"Elektroinnung"]
[null,"Prüfungs-Nr.:",null,3]
[null,"Name:"]
[]
[null,"Prüfungsteile",null,null,"Punkte",null,null,"Punkte","Ergebnis Teil 1"]
[null,null,null,null,"vom Prüfer auszufüllen, max. 100 Pkt.","Gewichtung I","Gewichtung II",null,"Prüfungs-Nr.:",null,{"$f":"IF(D14=\"\",\"\",D14)","v":3}]
[null,null,null,null,null,null,null,null,"von",null,1,0.3]
[null,"Schriftliche Aufgabe",null,null,null,1,0.2,{"$f":"E20*G20","v":0},"Punktzahl",null,{"$f":"H20+H22+H24+H26+H28+H30","v":0},{"$f":"L19*K20","v":0}]
[]
[null,"Planung und Projektierung",null,null,null,1,0.2,{"$f":"E22*G22","v":0}]
[]
[null,"Praktische Aufgabe",null,null,null,1,0.3,{"$f":"E24*G24","v":0}]
[]
[null,"Inbetribenahme und Übergabe",null,null,null,1,0.1,{"$f":"E26*G26","v":0}]
[]
[null,"Systemanalyse/Fehlersuche",null,null,null,1,0.1,{"$f":"E28*G28","v":0}]
[]
[null,"Situatives Fachgespräch",null,null,null,1,0.1,{"$f":"E30*G30","v":0}]

{"sheet":"Teil 1+2","index":1,"n_rows":49,"n_cols":19,"rows_kept":49,"cut":false,"hidden":false,"merged":[[1,4,7,13],[16,11,16,13],[10,1,10,3],[16,7,16,9],[11,1,11,3],[13,1,13,2],[8,1,8,3],[9,1,9,3],[12,1,12,2],[16,1,16,3],[14,1,14,2],[18,2,19,3],[18,4,19,4],[23,7,23,8],[20,8,21,8],[26,2,27,2],[27,7,27,8],[20,18,21,18],[20,2,21,2],[22,2,23,2],[22,10,23,10],[22,9,27,9],[24,16,25,17],[20,13,27,13],[24,2,25,2],[24,15,25,15],[26,16,27,17],[26,15,27,15],[20,12,27,12],[20,11,27,11],[24,10,25,10],[35,11,35,17],[20,7,21,7],[28,7,28,8],[17,7,17,9],[18,8,19,8],[25,7,25,8],[40,4,40,8],[20,10,21,10],[26,10,27,10],[10,14,10,16],[18,14,19,14],[20,17,21,17],[20,16,21,16],[20,14,27,14],[20,15,21,15],[20,1,27,1],[18,15,19,15],[16,15,16,17],[17,15,17,17],[18,11,19,11],[18,16,19,17],[18,12,19,12],[20,9,21,9],[18,9,19,9],[17,11,17,13],[18,13,19,13],[17,1,17,3],[18,7,19,7],[18,5,19,5],[18,10,19,10],[18,1,19,1]]}
[]
[null,"Version: 2023 ZVEH",null,null,"Erläuterungen:   \nDer Prüfling hat die Prüfung bestanden, wenn:\n1.) Teil 1 Ges.Prfg.(30%) + Teil 2 Ges.Prfg.(70%) = Gesamtergeb. mind. \"ausreichend\"\n2.) Gesamtergeb. Teil 2 mind. \"ausreichend\"\n3.) Prüfungsbereich Kundenauftrag mind. \"ausreichend\"\n4.) mind. zwei der übrigen Prüfungsbereiche v. Teil 2 mit mind. \"ausreichend\"\n5.) in keinem Prüfungsbereich von Teil 2 \"ungenügend\"\n\n"]
[null,"Gültig für Ausbildungsverordnung ab 2021"]
[]
[]
[]
[]
[]
[null,"Gesamtergebnisberechnung  für die "]
[null,"Gesellenprüfung zum/zur Elektroniker/-in"]
[null,"Fachrichtung Energie- und Gebäudetechnik"]
[]
[null,"Elektroinnung"]
[null,"Prüfungs-Nr.:"]
[null,"Name:"]
[]
[null,"Prüfungsteile",null,null,"Punkte","Gewichtung I","Gewichtung Ib","Zwischenergebnis I",null,null,"Gewichtung II","Zwischenergebnis II",null,null,"Gewichtung III","Endergebnis"]
[null,null,null,null,"vom Prüfer auszufüllen, max. 100 Pkt.","Falls keine mündliche Ergänzungs-Prüfung abgelegt wurde","Falls eine münliche Ergänzungs-Prüfung abgelegt wurde","Ergebnis der einzelnen \nAufgabenteile",null,null,null,"Ergebnis von Aufgabe 1 \nund  Aufgabe 2",null,null,null,"Gesamtergebnis"]
[null,"Teil 1","Prüfungsbereich: Arbeitsauftrag\n(Ausführung komplexer Arbeitsaufgabe)",null,{"$f":"'Teil 1'!K20","v":0},1,null,{"$f":"IF(E19<0,\"Fehler!\",IF(E19>100,\"Fehler!\",ROUND(E19*F19,2)))","v":0},"Punkte",{"$f":"IF(H19=\"Fehler!\",\" \",VLOOKUP($H$19,Notenmatrix!$A$2:$E$7,2,1))","v":"ungenügend"},1,{"$f":"IF(H19=\"Fehler!\",\" \",H19*K19)","v":0},"Punkte",{"$f":"IF(L19=\" \",\" \",VLOOKUP(L19,Notenmatrix!$A$2:$E$7,2,1))","v":"ungenügend"},0.3,"Prüfungs-Nr.:",{"$f":"IF(D14=\"\",\"\",D14)","v":""}]
[]
[null,"Teil 2","Kundenauftrag","Arbeitsaufgabe",null,0.8,null,{"$f":"IF(E21>100,\"Fehler!\",IF(E21<0,\"Fehler!\",IF(E22>100,\"Fehler!\",IF(E22<0,\"Fehler!\",ROUND(E21*F21+E22*F22,2)))))","v":0},"Punkte",{"$f":"IF(H21=\"Fehler!\",\" \",VLOOKUP($H$21,Notenmatrix!$A$2:$E$7,2,1))","v":"ungenügend"},{"$f":"100/70*36%","v":0.51428571428571423},{"$f":"IF(H21=\"Fehler!\",\" \",IF(H23=\"Fehler!\",\" \",IF(H25=\"Fehler!\",\" \",IF(H27=\"Fehler!\",\" \",H21*K21+H23*K23+H25*K25+H27*K27))))","v":0},"Punkte",{"$f":"IF(L21=\" \",\" \",VLOOKUP(L21,Notenmatrix!$A$2:$E$7,2,1))","v":"ungenügend"},0.7,"Punktzahl:",{"$f":"ROUNDDOWN($L$19*$O$19+$L$21*$O$21,2)","v":0},"Punkte",{"$f":"ROUNDDOWN(Q21,0)","v":0}]
[null,null,null,"Situatives Fachgespräch",null,0.2,null,null,null,null,null,null,null,null,null,null,{"$f":"$E$19*$O$19+$L$21*$O$21","v":0}]
[null,null,"Systementwurf","schriftlich",null,1,0.66666666666666663,{"$f":"IF(E24=\"\",ROUND(E23*F23,2),ROUND(E23*2/3+E24/3,2))","v":0},"Punkte",{"$f":"IF(H23=\"Fehler!\",\"Fehler!\",IF(H25=\"Fehler!\",\"Fehler!\",IF(H27=\"Fehler!\",\"Fehler!\",VLOOKUP(H23*0.35714+H25*0.35714+H27*0.28572,Notenmatrix!$A$2:$E$7,2,1))))","v":"ungenügend"},{"$f":"100/70*12%","v":0.17142857142857143},null,null,null,null,null,"sehr gut",null,{"$f":"ROUNDDOWN(H23,0)","v":0}]
[null,null,null,"mündlich (bei Bedarf)*",null,0,0.33333333333333331,{"$f":"IF(H23=\"Fehler!\",\" \",VLOOKUP($H$23,Notenmatrix!$A$2:$E$7,5,1))","v":"(ungenügend)"}]
[null,null,"Funktions- und \nSystemanalyse","schriftlich",null,1,0.66666666666666663,{"$f":"IF(E26=\"\",ROUND(E25*F25,2),ROUND(E25*2/3+E26/3,2))","v":0},"Punkte",null,{"$f":"100/70*12%","v":0.17142857142857143},null,null,null,null,"Note:",null,null,{"$f":"ROUNDDOWN(H25,0)","v":0}]
[null,null,null,"mündlich (bei Bedarf)*",null,0,0.33333333333333331,{"$f":"IF(H25=\"Fehler!\",\" \",VLOOKUP($H$25,Notenmatrix!$A$2:$E$7,5,1))","v":"(ungenügend)"}]
[null,null,"Wirtschafts- u. \nSozialkunde","schriftlich",null,1,0.66666666666666663,{"$f":"IF(E28=\"\",ROUND(E27*F27,2),ROUND(E27*2/3+E28/3,2))","v":0},"Punkte",null,{"$f":"100/70*10%","v":0.14285714285714288},null,null,null,null,"Prüfung:",null,null,{"$f":"ROUNDDOWN(H27,0)","v":0}]
[null,null,null,"mündlich (bei Bedarf)*",null,0,0.33333333333333331,{"$f":"IF(H27=\"Fehler!\",\" \",VLOOKUP($H$27,Notenmatrix!$A$2:$E$7,5,1))","v":"(ungenügend)"},{"$f":"VLOOKUP($H$27,Notenmatrix!$A$2:$E$7,2,1)","v":"ungenügend"}]
[null,null,null,null,null,null,null,"Teil 2.b =",null,{"$f":"H23*0.35714+H25*0.35714+H27*0.28572","v":0}]
[]
[]
[]
[]
[]
[null,null,null,null,null,null,null,null,null,null,null,"Bestehen durch mündl. Ergänzungsprüfung möglich?"]
[]
[]
[]
[]
[]
[null,null,null,null,"Löschen der Werte:\n\"mündlich (bei Bedarf)\" "]
[]
[]
[]
[]
[]
[]
[]
[null,null,null,null,null,null,null,null,{"$f":"IF(AND(I57>=50,SUM(I59,I61,I63)<150),\"Hinweis: zu empfehlen !!\", \" \")","v":" "}]

{"sheet":"Notenmatrix","index":2,"n_rows":7,"n_cols":6,"rows_kept":7,"cut":false,"hidden":true,"merged":[]}
["Punkte","Note"]
[0,"ungenügend",0,0,"(ungenügend)",0]
[30,"mangelhaft",1,0,"(mangelhaft)",1]
[50,"ausreichend",2,2,"(ausreichend)",2]
[67,"befriedigend",2,2,"(befriedigend)",2]
[81,"gut",2,2,"(gut)",2]
[92,"sehr gut",2,2,"(sehr gut)",2]